Reaction Details
TargetHistone-lysine N-methyltransferase EHMT2
LigandBDBM50315537
Substrate/Competitorn/a
Meas. Tech.ChEMBL_1294294 (CHEMBL3128971)
IC50 2570±n/a nM
Citation Cherblanc, FLChapman, KLReid, JBorg, AJSundriyal, SAlcazar-Fuoli, LBignell, EDemetriades, MSchofield, CJDiMaggio, PABrown, RFuchter, MJ On the histone lysine methyltransferase activity of fungal metabolite chaetocin. J Med Chem56:8616-25 (2013) 
 
Histone-lysine N-methyltransferase EHMT2
Name:Histone-lysine N-methyltransferase EHMT2
Type:Enzyme
Mol. Mass.:132339.87
Organism:Homo sapiens (Human)
Description:Q96KQ7
Residue:1210
BDBM50315537
NameBDBM50315537
Synonyms:CHEMBL1089316 | chaetocin
TypeSmall organic molecule
Emp. Form.C30H28N6O6S4
Mol. Mass.696.84
SMILESCN1C(=O)[C@@]23C[C@]4([C@H](Nc5ccccc45)N2C(=O)[C@]1(CO)SS3)[C@]12C[C@]34SS[C@](CO)(N(C)C3=O)C(=O)N4[C@H]1Nc1ccccc21