Reaction Details
TargetHistone-lysine N-methyltransferase EHMT2
LigandBDBM50448441
Substrate/Competitorn/a
Meas. Tech.ChEMBL_1294294 (CHEMBL3128971)
IC50 4900±n/a nM
Citation Cherblanc, FLChapman, KLReid, JBorg, AJSundriyal, SAlcazar-Fuoli, LBignell, EDemetriades, MSchofield, CJDiMaggio, PABrown, RFuchter, MJ On the histone lysine methyltransferase activity of fungal metabolite chaetocin. J Med Chem56:8616-25 (2013) 
 
Histone-lysine N-methyltransferase EHMT2
Name:Histone-lysine N-methyltransferase EHMT2
Type:Enzyme
Mol. Mass.:132339.87
Organism:Homo sapiens (Human)
Description:Q96KQ7
Residue:1210
BDBM50448441
NameBDBM50448441
Synonyms:CHEMBL3124975
TypeSmall organic molecule
Emp. Form.C18H16N2O2S2
Mol. Mass.356.462
SMILESO=C1[C@@H]2SS[C@H](N1Cc1ccccc1)C(=O)N2Cc1ccccc1