Reaction Details
TargetLeukocyte tyrosine kinase receptor
LigandBDBM50448449
Substrate/Competitorn/a
Meas. Tech.ChEMBL_1296026 (CHEMBL3131076)
IC50 10600±n/a nM
Citation Shahani, VMBall, DPRamos, AVLi, ZSpagnuolo, PAHaftchenary, SSchimmer, ADTrudel, SGunning, PT A 2,6,9-hetero-trisubstituted purine inhibitor exhibits potent biological effects against multiple myeloma cells. Bioorg Med Chem21:5618-28 (2013) 
 
Leukocyte tyrosine kinase receptor
Name:Leukocyte tyrosine kinase receptor
Type:PROTEIN
Mol. Mass.:91679.76
Organism:Homo sapiens (Human)
Description:ChEMBL_586334
Residue:864
BDBM50448449
NameBDBM50448449
Synonyms:CHEMBL3125667
TypeSmall organic molecule
Emp. Form.C26H30FN7O3S
Mol. Mass.539.625
SMILESNS(=O)(=O)OCCn1cnc2c(Nc3ccc(F)cc3)nc(NCc3ccc(cc3)C3CCCCC3)nc12