Reaction Details
Target5-hydroxytryptamine receptor 4
LigandBDBM50327858
Substrate/Competitorn/a
Meas. Tech.ChEMBL_1297282 (CHEMBL3132068)
Kd 0.080000±n/a nM
Citation Caillé, FMorley, TJTavares, AAPapin, CTwardy, NMAlagille, DLee, HSBaldwin, RMSeibyl, JPBarret, OTamagnan, GD Synthesis and biological evaluation of positron emission tomography radiotracers targeting serotonin 4 receptors in brain: [18F]MNI-698 and [18F]MNI-699. Bioorg Med Chem Lett23:6243-7 (2013) 
 
5-hydroxytryptamine receptor 4
Name:5-hydroxytryptamine receptor 4
Type:PROTEIN
Mol. Mass.:45024.02
Organism:Sus scrofa
Description:ChEMBL_1297282
Residue:402
BDBM50327858
NameBDBM50327858
Synonyms:(1-Butylpiperidin-4-yl)methyl 8-amino-7-iodo-2,3-dihydrobenzo-[b][1,4]dioxine-5-carboxylate CHEMBL114112 SB207710
TypeSmall organic molecule
Emp. Form.C19H27IN2O4
Mol. Mass.474.3332
SMILESCCCCN1CCC(COC(=O)c2cc(I)c(N)c3OCCOc23)CC1