Reaction Details
TargetInduced myeloid leukemia cell differentiation protein Mcl-1
LigandBDBM50448451
Substrate/Competitorn/a
Meas. Tech.ChEMBL_1297287 (CHEMBL3132073)
IC50 88±n/a nM
Citation Tanaka, YAikawa, KNishida, GHomma, MSogabe, SIgaki, SHayano, YSameshima, TMiyahisa, IKawamoto, TTawada, MImai, YInazuka, MCho, NImaeda, YIshikawa, T Discovery of potent Mcl-1/Bcl-xL dual inhibitors by using a hybridization strategy based on structural analysis of target proteins. J Med Chem56:9635-45 (2014) 
 
Induced myeloid leukemia cell differentiation protein Mcl-1
Name:Induced myeloid leukemia cell differentiation protein Mcl-1
Type:Membrane; Single-pass membrane protein
Mol. Mass.:37332.87
Organism:Homo sapiens (Human)
Description:Q07820
Residue:350
BDBM50448451
NameBDBM50448451
Synonyms:CHEMBL3126120
TypeSmall organic molecule
Emp. Form.C48H48N6O8S2
Mol. Mass.901.06
SMILESCN(C)CC[C@H](CSc1ccccc1)Nc1ccc(cc1[N+]([O-])=O)S(=O)(=O)NC(=O)c1cc(C)c(c(C)c1)-c1cccc2c(CCCOc3cccc4ccccc34)c(nn12)C(O)=O