Reaction Details
TargetThyroid hormone receptor beta
LigandBDBM50448465
Substrate/Competitorn/a
Meas. Tech.ChEMBL_1297822 (CHEMBL3131648)
EC50 37±n/a nM
Citation Takahashi, NMaeda, KAsano, YWatanabe, N Synthesis and pharmacological characterization of 1-benzyl-4-aminoindole-based thyroid hormone receptorß agonists. Bioorg Med Chem22:488-98 (2013) 
 
Thyroid hormone receptor beta
Name:Thyroid hormone receptor beta
Type:Receptor
Mol. Mass.:52793.62
Organism:Homo sapiens (Human)
Description:Recombinant hThR was obtained from nuclear extracts from SF9 cells infected with baculovirus vectors encoding for ThRbeta 1.
Residue:461
BDBM50448465
NameBDBM50448465
Synonyms:CHEMBL3126375
TypeSmall organic molecule
Emp. Form.C23H27NO3
Mol. Mass.365.4654
SMILESCC(C)c1cc(Cn2c(C)c(CCCC(O)=O)c3ccccc23)ccc1O