Reaction Details
TargetThyroid hormone receptor alpha
LigandBDBM50448467
Substrate/Competitorn/a
Meas. Tech.ChEMBL_1297823 (CHEMBL3131649)
EC50 450±n/a nM
Citation Takahashi, NMaeda, KAsano, YWatanabe, N Synthesis and pharmacological characterization of 1-benzyl-4-aminoindole-based thyroid hormone receptorß agonists. Bioorg Med Chem22:488-98 (2013) 
 
Thyroid hormone receptor alpha
Name:Thyroid hormone receptor alpha
Type:Receptor
Mol. Mass.:54818.00
Organism:Homo sapiens (Human)
Description:Recombinant hThR was obtained from nuclear extracts from SF9 cells infected with baculovirus vectors encoding for ThRalpha 1.
Residue:490
BDBM50448467
NameBDBM50448467
Synonyms:CHEMBL3126373
TypeSmall organic molecule
Emp. Form.C21H23NO3
Mol. Mass.337.4122
SMILESCC(C)c1cc(Cn2c(C)c(CC(O)=O)c3ccccc23)ccc1O