Reaction Details
TargetThyroid hormone receptor beta
LigandBDBM50448464
Substrate/Competitorn/a
Meas. Tech.ChEMBL_1297825 (CHEMBL3131651)
IC50 1400±n/a nM
Citation Takahashi, NMaeda, KAsano, YWatanabe, N Synthesis and pharmacological characterization of 1-benzyl-4-aminoindole-based thyroid hormone receptorß agonists. Bioorg Med Chem22:488-98 (2013) 
 
Thyroid hormone receptor beta
Name:Thyroid hormone receptor beta
Type:Receptor
Mol. Mass.:52793.62
Organism:Homo sapiens (Human)
Description:Recombinant hThR was obtained from nuclear extracts from SF9 cells infected with baculovirus vectors encoding for ThRbeta 1.
Residue:461
BDBM50448464
NameBDBM50448464
Synonyms:CHEMBL3126376
TypeSmall organic molecule
Emp. Form.C24H29NO3
Mol. Mass.379.492
SMILESCC(C)c1cc(Cn2c(C)c(CCCCC(O)=O)c3ccccc23)ccc1O