Reaction Details
TargetDNA (cytosine-5)-methyltransferase 1
LigandBDBM50448484
Substrate/Competitorn/a
Meas. Tech.ChEMBL_1294384 (CHEMBL3129169)
IC50 9000±n/a nM
Citation Valente, SLiu, YSchnekenburger, MZwergel, CCosconati, SGros, CTardugno, MLabella, DFlorean, CMinden, SHashimoto, HChang, YZhang, XKirsch, GNovellino, EArimondo, PBMiele, EFerretti, EGulino, ADiederich, MCheng, XMai, A Selective non-nucleoside inhibitors of human DNA methyltransferases active in cancer including in cancer stem cells. J Med Chem57:701-13 (2014) 
 
DNA (cytosine-5)-methyltransferase 1
Name:DNA (cytosine-5)-methyltransferase 1
Type:Enzyme
Mol. Mass.:183184.85
Organism:Homo sapiens (Human)
Description:P26358
Residue:1616
BDBM50448484
NameBDBM50448484
Synonyms:CHEMBL3126646
TypeSmall organic molecule
Emp. Form.C27H23N7O
Mol. Mass.461.5178
SMILESCc1cc(Nc2cccc(NC(=O)c3cccc(Nc4ccnc5ccccc45)c3)c2)nc(N)n1