Reaction Details
TargetCoagulation factor X
LigandBDBM50448585
Substrate/Competitorn/a
Meas. Tech.ChEMBL_1296330 (CHEMBL3129589)
Ki 641±n/a nM
Citation Quan, MLWong, PCWang, CWoerner, FSmallheer, JMBarbera, FABozarth, JMBrown, RLHarpel, MRLuettgen, JMMorin, PEPeterson, TRamamurthy, VRendina, ARRossi, KAWatson, CAWei, AZhang, GSeiffert, DWexler, RR Tetrahydroquinoline derivatives as potent and selective factor XIa inhibitors. J Med Chem57:955-69 (2014) 
 
Coagulation factor X
Name:Coagulation factor X
Type:Enzyme
Mol. Mass.:54726.60
Organism:Homo sapiens (Human)
Description:n/a
Residue:488
BDBM50448585
NameBDBM50448585
Synonyms:CHEMBL3127489
TypeSmall organic molecule
Emp. Form.C35H35N5O4
Mol. Mass.589.6835
SMILESCCCC(=O)Nc1cc(cc(c1)-c1ccc(cc1C(O)=O)C(N)=O)[C@@H]1C[C@](C)(c2ccccc2)c2cc(ccc2N1)C(N)=N