Reaction Details
TargetCoagulation factor X
LigandBDBM50448609
Substrate/Competitorn/a
Meas. Tech.ChEMBL_1296330 (CHEMBL3129589)
Ki 1940±n/a nM
Citation Quan, MLWong, PCWang, CWoerner, FSmallheer, JMBarbera, FABozarth, JMBrown, RLHarpel, MRLuettgen, JMMorin, PEPeterson, TRamamurthy, VRendina, ARRossi, KAWatson, CAWei, AZhang, GSeiffert, DWexler, RR Tetrahydroquinoline derivatives as potent and selective factor XIa inhibitors. J Med Chem57:955-69 (2014) 
 
Coagulation factor X
Name:Coagulation factor X
Type:Enzyme
Mol. Mass.:54726.60
Organism:Homo sapiens (Human)
Description:n/a
Residue:488
BDBM50448609
NameBDBM50448609
Synonyms:CHEMBL3127465
TypeSmall organic molecule
Emp. Form.C29H25N3O2
Mol. Mass.447.5277
SMILESNC(=N)c1ccc2N[C@@H](C[C@H](c3ccccc3)c2c1)c1ccccc1-c1ccccc1C(O)=O