Reaction Details
TargetCoagulation factor XI
LigandBDBM50448588
Substrate/Competitorn/a
Meas. Tech.ChEMBL_1296332 (CHEMBL3129742)
Ki 0.640000±n/a nM
Citation Quan, MLWong, PCWang, CWoerner, FSmallheer, JMBarbera, FABozarth, JMBrown, RLHarpel, MRLuettgen, JMMorin, PEPeterson, TRamamurthy, VRendina, ARRossi, KAWatson, CAWei, AZhang, GSeiffert, DWexler, RR Tetrahydroquinoline derivatives as potent and selective factor XIa inhibitors. J Med Chem57:955-69 (2014) 
 
Coagulation factor XI
Name:Coagulation factor XI
Type:Enzyme
Mol. Mass.:70130.58
Organism:Homo sapiens (Human)
Description:P03951
Residue:625
BDBM50448588
NameBDBM50448588
Synonyms:CHEMBL3127486
TypeSmall organic molecule
Emp. Form.C31H29N5O3
Mol. Mass.519.5937
SMILESC[C@@]1(C[C@H](Nc2ccc(cc12)C(N)=N)c1cc(N)cc(c1)-c1ccc(cc1C(O)=O)C(N)=O)c1ccccc1