Reaction Details
TargetDNA polymerase beta
LigandBDBM50448689
Substrate/Competitorn/a
Meas. Tech.ChEMBL_1297298 (CHEMBL3132084)
Ki 11600±n/a nM
Citation Mizushina, YSuzuki-Fukudome, HTakeuchi, TTakemoto, KKuriyama, IYoshida, HKamisuki, SSugawara, F Formosusin A, a novel specific inhibitor of mammalian DNA polymeraseß from the fungus Paecilomyces formosus. Bioorg Med Chem22:1070-6 (2014) 
 
DNA polymerase beta
Name:DNA polymerase beta
Type:PROTEIN
Mol. Mass.:38334.34
Organism:Rattus norvegicus
Description:ChEMBL_1361926
Residue:335
BDBM50448689
NameBDBM50448689
Synonyms:CHEMBL3127730
TypeSmall organic molecule
Emp. Form.C17H25NO3
Mol. Mass.291.3853
SMILESCCCC[C@@H](O)\C=C(/C)\C=C\C=C/C(=O)N1CCCC1=O