Reaction Details
TargetDNA nucleotidylexotransferase
LigandBDBM50448688
Substrate/Competitorn/a
Meas. Tech.ChEMBL_1297318 (CHEMBL3132283)
IC50>200000±n/a nM
Citation Mizushina, YSuzuki-Fukudome, HTakeuchi, TTakemoto, KKuriyama, IYoshida, HKamisuki, SSugawara, F Formosusin A, a novel specific inhibitor of mammalian DNA polymeraseß from the fungus Paecilomyces formosus. Bioorg Med Chem22:1070-6 (2014) 
 
DNA nucleotidylexotransferase
Name:DNA nucleotidylexotransferase
Type:PROTEIN
Mol. Mass.:58304.95
Organism:Bos taurus
Description:ChEMBL_1297318
Residue:509
BDBM50448688
NameBDBM50448688
Synonyms:Pecilocin | Variotin
TypeSmall organic molecule
Emp. Form.C17H25NO3
Mol. Mass.291.3853
SMILESCCCC[C@@H](O)\C=C(/C)\C=C\C=C\C(=O)N1CCCC1=O