Reaction Details
Target11-beta-hydroxysteroid dehydrogenase 1
LigandBDBM50448705
Substrate/Competitorn/a
Meas. Tech.ChEMBL_1297893 (CHEMBL3132106)
IC50 12±n/a nM
Citation Goldberg, FWDossetter, AGScott, JSRobb, GRBoyd, SGroombridge, SDKemmitt, PDSjögren, TGutierrez, PMdeSchoolmeester, JSwales, JGTurnbull, AVWild, MJ Optimization of brain penetrant 11ß-hydroxysteroid dehydrogenase type I inhibitors and in vivo testing in diet-induced obese mice. J Med Chem57:970-86 (2014) 
 
11-beta-hydroxysteroid dehydrogenase 1
Name:11-beta-hydroxysteroid dehydrogenase 1
Type:Enzyme
Mol. Mass.:32409.16
Organism:Homo sapiens (Human)
Description:P28845
Residue:292
BDBM50448705
NameBDBM50448705
Synonyms:CHEMBL3127855
TypeSmall organic molecule
Emp. Form.C21H30N2O5S
Mol. Mass.422.538
SMILESCOCCOc1nc([C@H]2CCCO2)c(s1)C(=O)NC1C2CC3CC1CC(O)(C3)C2