Reaction Details
Target11-beta-hydroxysteroid dehydrogenase 1
LigandBDBM50448733
Substrate/Competitorn/a
Meas. Tech.ChEMBL_1297897 (CHEMBL3132110)
IC50 1.4±n/a nM
Citation Goldberg, FWDossetter, AGScott, JSRobb, GRBoyd, SGroombridge, SDKemmitt, PDSjögren, TGutierrez, PMdeSchoolmeester, JSwales, JGTurnbull, AVWild, MJ Optimization of brain penetrant 11ß-hydroxysteroid dehydrogenase type I inhibitors and in vivo testing in diet-induced obese mice. J Med Chem57:970-86 (2014) 
 
11-beta-hydroxysteroid dehydrogenase 1
Name:11-beta-hydroxysteroid dehydrogenase 1
Type:Enzyme
Mol. Mass.:32409.16
Organism:Homo sapiens (Human)
Description:P28845
Residue:292
BDBM50448733
NameBDBM50448733
Synonyms:CHEMBL3127866
TypeSmall organic molecule
Emp. Form.C21H28N2O4S
Mol. Mass.404.523
SMILESO[C@@]12CC3CC(C1)[C@H](NC(=O)c1sc(O[C@@H]4CCCO4)nc1C1CC1)C(C3)C2