Reaction Details
Target11-beta-hydroxysteroid dehydrogenase 1
LigandBDBM50448702
Substrate/Competitorn/a
Meas. Tech.ChEMBL_1297897 (CHEMBL3132110)
IC50 1.7±n/a nM
Citation Goldberg, FWDossetter, AGScott, JSRobb, GRBoyd, SGroombridge, SDKemmitt, PDSjögren, TGutierrez, PMdeSchoolmeester, JSwales, JGTurnbull, AVWild, MJ Optimization of brain penetrant 11ß-hydroxysteroid dehydrogenase type I inhibitors and in vivo testing in diet-induced obese mice. J Med Chem57:970-86 (2014) 
 
11-beta-hydroxysteroid dehydrogenase 1
Name:11-beta-hydroxysteroid dehydrogenase 1
Type:Enzyme
Mol. Mass.:32409.16
Organism:Homo sapiens (Human)
Description:P28845
Residue:292
BDBM50448702
NameBDBM50448702
Synonyms:CHEMBL3127860
TypeSmall organic molecule
Emp. Form.C19H26N2O3S
Mol. Mass.362.486
SMILESCCOc1nc(C2CC2)c(s1)C(=O)N[C@H]1C2CC3CC1C[C@](O)(C3)C2