Reaction Details
TargetDihydrofolate reductase
LigandBDBM50448744
Substrate/Competitorn/a
Meas. Tech.ChEMBL_1298221 (CHEMBL3130226)
Ki 0.011000±n/a nM
Citation Lam, THilgers, MTCunningham, MLKwan, BPNelson, KJBrown-Driver, VOng, VTrzoss, MHough, GShaw, KJFinn, J Structure-based design of new dihydrofolate reductase antibacterial agents: 7-(benzimidazol-1-yl)-2,4-diaminoquinazolines. J Med Chem57:651-68 (2014) 
 
Dihydrofolate reductase
Name:Dihydrofolate reductase
Type:Enzyme
Mol. Mass.:18249.71
Organism:Staphylococcus aureus
Description:n/a
Residue:159
BDBM50448744
NameBDBM50448744
Synonyms:CHEMBL3128014 US8835445, 34
TypeSmall organic molecule
Emp. Form.C20H16ClN7S
Mol. Mass.421.906
SMILESCc1cc2nc(-c3nccs3)n(-c3cc4nc(N)nc(N)c4cc3Cl)c2cc1C