Reaction Details
TargetDihydrofolate reductase
LigandBDBM50448753
Substrate/Competitorn/a
Meas. Tech.ChEMBL_1298221 (CHEMBL3130226)
Ki 0.022000±n/a nM
Citation Lam, THilgers, MTCunningham, MLKwan, BPNelson, KJBrown-Driver, VOng, VTrzoss, MHough, GShaw, KJFinn, J Structure-based design of new dihydrofolate reductase antibacterial agents: 7-(benzimidazol-1-yl)-2,4-diaminoquinazolines. J Med Chem57:651-68 (2014) 
 
Dihydrofolate reductase
Name:Dihydrofolate reductase
Type:Enzyme
Mol. Mass.:18249.71
Organism:Staphylococcus aureus
Description:n/a
Residue:159
BDBM50448753
NameBDBM50448753
Synonyms:CHEMBL3127912 | US8835445, 16
TypeSmall organic molecule
Emp. Form.C22H19N7
Mol. Mass.381.4332
SMILESCc1cc2nc(-c3ccccn3)n(-c3ccc4c(N)nc(N)nc4c3)c2cc1C