Reaction Details
TargetSerine/threonine-protein kinase PAK 1
LigandBDBM50448778
Substrate/Competitorn/a
Meas. Tech.ChEMBL_1294409 (CHEMBL3129194)
Ki>4500±n/a nM
Citation Staben, STFeng, JALyle, KBelvin, MBoggs, JBurch, JDChua, CCCui, HDiPasquale, AGFriedman, LSHeise, CKoeppen, HKotey, AMintzer, ROh, ARoberts, DARouge, LRudolph, JTam, CWang, WXiao, YYoung, AZhang, YHoeflich, KP Back pocket flexibility provides group II p21-activated kinase (PAK) selectivity for type I 1/2 kinase inhibitors. J Med Chem57:1033-45 (2014) 
 
Serine/threonine-protein kinase PAK 1
Name:Serine/threonine-protein kinase PAK 1
Type:n/a
Mol. Mass.:60640.15
Organism:Homo sapiens (Human)
Description:Q13153
Residue:545
BDBM50448778
NameBDBM50448778
Synonyms:CHEMBL3128052
TypeSmall organic molecule
Emp. Form.C19H17N7O2
Mol. Mass.375.384
SMILESCc1cc(no1)[C@](C)(O)C#Cc1ccc2nc(C)n(-c3ncnc(N)n3)c2c1