Reaction Details
TargetSerine/threonine-protein kinase PAK 1
LigandBDBM50448779
Substrate/Competitorn/a
Meas. Tech.ChEMBL_1294409 (CHEMBL3129194)
Ki>4500±n/a nM
Citation Staben, STFeng, JALyle, KBelvin, MBoggs, JBurch, JDChua, CCCui, HDiPasquale, AGFriedman, LSHeise, CKoeppen, HKotey, AMintzer, ROh, ARoberts, DARouge, LRudolph, JTam, CWang, WXiao, YYoung, AZhang, YHoeflich, KP Back pocket flexibility provides group II p21-activated kinase (PAK) selectivity for type I 1/2 kinase inhibitors. J Med Chem57:1033-45 (2014) 
 
Serine/threonine-protein kinase PAK 1
Name:Serine/threonine-protein kinase PAK 1
Type:n/a
Mol. Mass.:60640.15
Organism:Homo sapiens (Human)
Description:Q13153
Residue:545
BDBM50448779
NameBDBM50448779
Synonyms:CHEMBL3128051
TypeSmall organic molecule
Emp. Form.C20H20N6O
Mol. Mass.360.4124
SMILESCc1nc2ccc(cc2n1-c1ncnc(N)n1)C#C[C@@]1(O)C[C@@H]2CC[C@H]1C2