Reaction Details
TargetSerine/threonine-protein kinase PAK 4
LigandBDBM50448781
Substrate/Competitorn/a
Meas. Tech.ChEMBL_1294410 (CHEMBL3129195)
Ki>2900±n/a nM
Citation Staben, STFeng, JALyle, KBelvin, MBoggs, JBurch, JDChua, CCCui, HDiPasquale, AGFriedman, LSHeise, CKoeppen, HKotey, AMintzer, ROh, ARoberts, DARouge, LRudolph, JTam, CWang, WXiao, YYoung, AZhang, YHoeflich, KP Back pocket flexibility provides group II p21-activated kinase (PAK) selectivity for type I 1/2 kinase inhibitors. J Med Chem57:1033-45 (2014) 
 
Serine/threonine-protein kinase PAK 4
Name:Serine/threonine-protein kinase PAK 4
Type:Protein
Mol. Mass.:64098.01
Organism:Homo sapiens (Human)
Description:O96013
Residue:591
BDBM50448781
NameBDBM50448781
Synonyms:CHEMBL3128049
TypeSmall organic molecule
Emp. Form.C18H18N6O2
Mol. Mass.350.3745
SMILESCc1nc2ccc(cc2n1-c1ncnc(N)n1)C#CC1(O)CCCOC1