Reaction Details
TargetSerine/threonine-protein kinase PAK 4
LigandBDBM50448784
Substrate/Competitorn/a
Meas. Tech.ChEMBL_1294410 (CHEMBL3129195)
Ki>2900±n/a nM
Citation Staben, STFeng, JALyle, KBelvin, MBoggs, JBurch, JDChua, CCCui, HDiPasquale, AGFriedman, LSHeise, CKoeppen, HKotey, AMintzer, ROh, ARoberts, DARouge, LRudolph, JTam, CWang, WXiao, YYoung, AZhang, YHoeflich, KP Back pocket flexibility provides group II p21-activated kinase (PAK) selectivity for type I 1/2 kinase inhibitors. J Med Chem57:1033-45 (2014) 
 
Serine/threonine-protein kinase PAK 4
Name:Serine/threonine-protein kinase PAK 4
Type:Protein
Mol. Mass.:64098.01
Organism:Homo sapiens (Human)
Description:O96013
Residue:591
BDBM50448784
NameBDBM50448784
Synonyms:CHEMBL3128045
TypeSmall organic molecule
Emp. Form.C17H18N6O
Mol. Mass.322.3644
SMILESCc1nc2ccc(cc2n1-c1ncnc(N)n1)C#CC(C)(C)CO