Reaction Details
TargetSerine/threonine-protein kinase PAK 4
LigandBDBM50448772
Substrate/Competitorn/a
Meas. Tech.ChEMBL_1294410 (CHEMBL3129195)
Ki 140±n/a nM
Citation Staben, STFeng, JALyle, KBelvin, MBoggs, JBurch, JDChua, CCCui, HDiPasquale, AGFriedman, LSHeise, CKoeppen, HKotey, AMintzer, ROh, ARoberts, DARouge, LRudolph, JTam, CWang, WXiao, YYoung, AZhang, YHoeflich, KP Back pocket flexibility provides group II p21-activated kinase (PAK) selectivity for type I 1/2 kinase inhibitors. J Med Chem57:1033-45 (2014) 
 
Serine/threonine-protein kinase PAK 4
Name:Serine/threonine-protein kinase PAK 4
Type:Protein
Mol. Mass.:64098.01
Organism:Homo sapiens (Human)
Description:O96013
Residue:591
BDBM50448772
NameBDBM50448772
Synonyms:CHEMBL3128041
TypeSmall organic molecule
Emp. Form.C19H22N6O2
Mol. Mass.366.417
SMILESCOCCNc1nc2ccc(cc2n1-c1ccnc(N)n1)C#CC(C)(C)O