Reaction Details
TargetAldehyde dehydrogenase, dimeric NADP-preferring
LigandBDBM50448790
Substrate/Competitorn/a
Meas. Tech.ChEMBL_1295316 (CHEMBL3130564)
IC50 360±n/a nM
Citation Kimble-Hill, ACParajuli, BChen, CHMochly-Rosen, DHurley, TD Development of selective inhibitors for aldehyde dehydrogenases based on substituted indole-2,3-diones. J Med Chem57:714-22 (2014) 
 
Aldehyde dehydrogenase, dimeric NADP-preferring
Name:Aldehyde dehydrogenase, dimeric NADP-preferring
Type:Protein
Mol. Mass.:50394.38
Organism:Homo sapiens (Human)
Description:n/a
Residue:453
BDBM50448790
NameBDBM50448790
Synonyms:CHEMBL3128208
TypeSmall organic molecule
Emp. Form.C9H6BrNO2
Mol. Mass.240.053
SMILESCc1cc2C(=O)C(=O)Nc2c(Br)c1