Reaction Details
TargetAldehyde dehydrogenase 1A1
LigandBDBM47902
Substrate/Competitorn/a
Meas. Tech.ChEMBL_1295319 (CHEMBL3130567)
IC50 70±n/a nM
Citation Kimble-Hill, ACParajuli, BChen, CHMochly-Rosen, DHurley, TD Development of selective inhibitors for aldehyde dehydrogenases based on substituted indole-2,3-diones. J Med Chem57:714-22 (2014) 
 
Aldehyde dehydrogenase 1A1
Name:Aldehyde dehydrogenase 1A1
Type:Protein
Mol. Mass.:54862.21
Organism:Homo sapiens (Human)
Description:n/a
Residue:501
BDBM47902
NameBDBM47902
Synonyms:1-[(2E)-3-phenylprop-2-enyl]-1H-indole-2,3-dione 1-[(E)-cinnamyl]isatin SMR000565059 | cid_2057118
TypeSmall organic molecule
Emp. Form.C17H13NO2
Mol. Mass.263.2906
SMILESO=C1N(C\C=C\c2ccccc2)c2ccccc2C1=O