Reaction Details
TargetProto-oncogene tyrosine-protein kinase receptor Ret
LigandBDBM50448808
Substrate/Competitorn/a
Meas. Tech.ChEMBL_1295327 (CHEMBL3130575)
IC50 24100±n/a nM
Citation Sartini, SCoviello, VBruno, ALa Pietra, VMarinelli, LSimorini, FTaliani, SSalerno, SMarini, AMFioravanti, AOrlandi, PAntonelli, ADa Settimo, FNovellino, EBocci, GLa Motta, C Structure-based optimization of tyrosine kinase inhibitor CLM3. Design, synthesis, functional evaluation, and molecular modeling studies. J Med Chem57:1225-35 (2014) 
 
Proto-oncogene tyrosine-protein kinase receptor Ret
Name:Proto-oncogene tyrosine-protein kinase receptor Ret
Type:Protein
Mol. Mass.:124318.29
Organism:Homo sapiens (Human)
Description:P07949
Residue:1114
BDBM50448808
NameBDBM50448808
Synonyms:CHEMBL3128232
TypeSmall organic molecule
Emp. Form.C28H26N6O2
Mol. Mass.478.545
SMILESCOc1ccc(cc1)C(=O)Nc1cccc(CNc2ncnc3n(CCc4ccccc4)ncc23)c1