Reaction Details
TargetProto-oncogene tyrosine-protein kinase receptor Ret
LigandBDBM50448809
Substrate/Competitorn/a
Meas. Tech.ChEMBL_1295327 (CHEMBL3130575)
IC50 17100±n/a nM
Citation Sartini, SCoviello, VBruno, ALa Pietra, VMarinelli, LSimorini, FTaliani, SSalerno, SMarini, AMFioravanti, AOrlandi, PAntonelli, ADa Settimo, FNovellino, EBocci, GLa Motta, C Structure-based optimization of tyrosine kinase inhibitor CLM3. Design, synthesis, functional evaluation, and molecular modeling studies. J Med Chem57:1225-35 (2014) 
 
Proto-oncogene tyrosine-protein kinase receptor Ret
Name:Proto-oncogene tyrosine-protein kinase receptor Ret
Type:Protein
Mol. Mass.:124318.29
Organism:Homo sapiens (Human)
Description:P07949
Residue:1114
BDBM50448809
NameBDBM50448809
Synonyms:CHEMBL3128231
TypeSmall organic molecule
Emp. Form.C27H23N7O3
Mol. Mass.493.5166
SMILES[O-][N+](=O)c1ccc(cc1)C(=O)Nc1cccc(CNc2ncnc3n(CCc4ccccc4)ncc23)c1