Reaction Details
TargetNitric oxide synthase, inducible
LigandBDBM50448825
Substrate/Competitorn/a
Meas. Tech.ChEMBL_1295338 (CHEMBL3130586)
Ki 1300±n/a nM
Citation Huang, HLi, HYang, SChreifi, GMartásek, PRoman, LJMeyskens, FLPoulos, TLSilverman, RB Potent and selective double-headed thiophene-2-carboximidamide inhibitors of neuronal nitric oxide synthase for the treatment of melanoma. J Med Chem57:686-700 (2014) 
 
Nitric oxide synthase, inducible
Name:Nitric oxide synthase, inducible
Type:Enzyme
Mol. Mass.:130595.79
Organism:Mus musculus (mouse)
Description:Recombinant enzyme overexpressed in E. coli.
Residue:1144
BDBM50448825
NameBDBM50448825
Synonyms:CHEMBL3128245
TypeSmall organic molecule
Emp. Form.C25H25N5S2
Mol. Mass.459.63
SMILESNC(=Nc1cccc(CCNCc2cccc(c2)N=C(N)c2cccs2)c1)c1cccs1