Reaction Details
TargetEnoyl-[acyl-carrier-protein] reductase [NADH]
LigandBDBM50448837
Substrate/Competitorn/a
Meas. Tech.ChEMBL_1296166 (CHEMBL3132000)
IC50 112±n/a nM
Citation Encinas, LO'Keefe, HNeu, MRemuiñán, MJPatel, AMGuardia, ADavie, CPPérez-Macías, NYang, HConvery, MAMesser, JAPérez-Herrán, ECentrella, PAAlvarez-Gómez, DClark, MAHuss, SO'Donovan, GKOrtega-Muro, FMcDowell, WCastañeda, PArico-Muendel, CCPajk, SRullás, JAngulo-Barturen, IAlvarez-Ruíz, EMendoza-Losana, ABallell Pages, LCastro-Pichel, JEvindar, G Encoded library technology as a source of hits for the discovery and lead optimization of a potent and selective class of bactericidal direct inhibitors of Mycobacterium tuberculosis InhA. J Med Chem57:1276-88 (2014) 
 
Enoyl-[acyl-carrier-protein] reductase [NADH]
Name:Enoyl-[acyl-carrier-protein] reductase [NADH]
Type:Enzyme
Mol. Mass.:28526.00
Organism:Mycobacterium tuberculosis (strain ATCC 25618 / H37Rv)
Description:P9WGR1
Residue:269
BDBM50448837
NameBDBM50448837
Synonyms:CHEMBL3125248
TypeSmall organic molecule
Emp. Form.C30H33N5O5
Mol. Mass.543.6135
SMILESCCc1cc(C(=O)N[C@@H]2C[C@H](N(C2)C(=O)c2coc3ccccc23)C(=O)N[C@H](CO)Cc2ccccc2)n(C)n1