Reaction Details
TargetCytochrome P450 2C9
LigandBDBM50448861
Substrate/Competitorn/a
Meas. Tech.ChEMBL_1296149 (CHEMBL3131783)
IC50>50000±n/a nM
Citation Encinas, LO'Keefe, HNeu, MRemuiñán, MJPatel, AMGuardia, ADavie, CPPérez-Macías, NYang, HConvery, MAMesser, JAPérez-Herrán, ECentrella, PAAlvarez-Gómez, DClark, MAHuss, SO'Donovan, GKOrtega-Muro, FMcDowell, WCastañeda, PArico-Muendel, CCPajk, SRullás, JAngulo-Barturen, IAlvarez-Ruíz, EMendoza-Losana, ABallell Pages, LCastro-Pichel, JEvindar, G Encoded library technology as a source of hits for the discovery and lead optimization of a potent and selective class of bactericidal direct inhibitors of Mycobacterium tuberculosis InhA. J Med Chem57:1276-88 (2014) 
 
Cytochrome P450 2C9
Name:Cytochrome P450 2C9
Type:Enzyme
Mol. Mass.:55636.33
Organism:Homo sapiens (Human)
Description:P11712
Residue:490
BDBM50448861
NameBDBM50448861
Synonyms:CHEMBL3125272
TypeSmall organic molecule
Emp. Form.C23H27N5O4
Mol. Mass.437.4916
SMILESCCNC(=O)[C@@H]1C[C@H](CN1C(=O)c1coc2ccccc12)NC(=O)c1cc(CC)nn1C