Reaction Details
TargetCarboxylesterase 1D
LigandBDBM50448893
Substrate/Competitorn/a
Meas. Tech.ChEMBL_1296363 (CHEMBL3129773)
IC50 460±n/a nM
Citation Otrubova, KCravatt, BFBoger, DL Design, synthesis, and characterization ofa-ketoheterocycles that additionally target the cytosolic port Cys269 of fatty acid amide hydrolase. J Med Chem57:1079-89 (2014) 
 
Carboxylesterase 1D
Name:Carboxylesterase 1D
Type:n/a
Mol. Mass.:61787.55
Organism:Mus musculus
Description:ChEMBL_108149
Residue:565
BDBM50448893
NameBDBM50448893
Synonyms:CHEMBL3125287
TypeSmall organic molecule
Emp. Form.C24H26N2O4S
Mol. Mass.438.539
SMILESCS(=O)(=O)C=Cc1ccc(nc1)-c1cnc(o1)C(=O)CCCCCCc1ccccc1