Reaction Details
TargetFatty-acid amide hydrolase 1 [30-579]
LigandBDBM50448895
Substrate/Competitorn/a
Meas. Tech.ChEMBL_1296376 (CHEMBL3129923)
Ki 0.600000±n/a nM
Citation Otrubova, KCravatt, BFBoger, DL Design, synthesis, and characterization ofa-ketoheterocycles that additionally target the cytosolic port Cys269 of fatty acid amide hydrolase. J Med Chem57:1079-89 (2014) 
 
Fatty-acid amide hydrolase 1 [30-579]
Name:Fatty-acid amide hydrolase 1 [30-579]
Type:Single-pass membrane protein; homodimer
Mol. Mass.:60474.00
Organism:Rattus norvegicus (rat)
Description:P97612 (aa 30-579)
Residue:550
BDBM50448895
NameBDBM50448895
Synonyms:CHEMBL3125310
TypeSmall organic molecule
Emp. Form.C24H27N3O3
Mol. Mass.405.4895
SMILESCOC(=N)Cc1ccc(nc1)-c1cnc(o1)C(=O)CCCCCCc1ccccc1