Reaction Details
TargetFatty-acid amide hydrolase 1 [30-579]
LigandBDBM50448896
Substrate/Competitorn/a
Meas. Tech.ChEMBL_1296378 (CHEMBL3129925)
Ki 0.900000±n/a nM
Citation Otrubova, KCravatt, BFBoger, DL Design, synthesis, and characterization ofa-ketoheterocycles that additionally target the cytosolic port Cys269 of fatty acid amide hydrolase. J Med Chem57:1079-89 (2014) 
 
Fatty-acid amide hydrolase 1 [30-579]
Name:Fatty-acid amide hydrolase 1 [30-579]
Type:Single-pass membrane protein; homodimer
Mol. Mass.:60474.00
Organism:Rattus norvegicus (rat)
Description:P97612 (aa 30-579)
Residue:550
BDBM50448896
NameBDBM50448896
Synonyms:CHEMBL3125307
TypeSmall organic molecule
Emp. Form.C23H23N3O2
Mol. Mass.373.4476
SMILESO=C(CCCCCCc1ccccc1)c1ncc(o1)-c1ccc(CC#N)cn1