Reaction Details
TargetE3 ubiquitin-protein ligase Mdm2
LigandBDBM50448960
Substrate/Competitorn/a
Meas. Tech.ChEMBL_1296787 (CHEMBL3132470)
IC50 0.400000±n/a nM
Citation Sun, DLi, ZRew, YGribble, MBartberger, MDBeck, HPCanon, JChen, AChen, XChow, DDeignan, JDuquette, JEksterowicz, JFisher, BFox, BMFu, JGonzalez, AZGonzalez-Lopez De Turiso, FHouze, JBHuang, XJiang, MJin, LKayser, FLiu, JJLo, MCLong, AMLucas, BMcGee, LRMcIntosh, JMihalic, JOliner, JDOsgood, TPeterson, MLRoveto, PSaiki, AYShaffer, PToteva, MWang, YWang, YCWortman, SYakowec, PYan, XYe, QYu, DYu, MZhao, XZhou, JZhu, JOlson, SHMedina, JC Discovery of AMG 232, a potent, selective, and orally bioavailable MDM2-p53 inhibitor in clinical development. J Med Chem57:1454-72 (2014) 
 
E3 ubiquitin-protein ligase Mdm2
Name:E3 ubiquitin-protein ligase Mdm2
Type:Oncoprotein
Mol. Mass.:55196.54
Organism:Homo sapiens (Human)
Description:Q00987
Residue:491
BDBM50448960
NameBDBM50448960
Synonyms:CHEMBL3125540 US9593129, Example 365
TypeSmall organic molecule
Emp. Form.C29H37Cl2NO5S
Mol. Mass.582.579
SMILESCC(C)S(=O)(=O)C[C@@H](N1[C@@H]([C@H](C[C@](C)(CC(O)=O)C1=O)c1cccc(Cl)c1)c1ccc(Cl)cc1)C(C)(C)C