Reaction Details
TargetLeucyl-cystinyl aminopeptidase
LigandBDBM50331048
Substrate/Competitorn/a
Meas. Tech.ChEMBL_1297665 (CHEMBL3130959)
Ki 30±n/a nM
Citation Mountford, SJAlbiston, ALCharman, WNNg, LHolien, JKParker, MWNicolazzo, JAThompson, PEChai, SY Synthesis, structure-activity relationships and brain uptake of a novel series of benzopyran inhibitors of insulin-regulated aminopeptidase. J Med Chem57:1368-77 (2014) 
 
Leucyl-cystinyl aminopeptidase
Name:Leucyl-cystinyl aminopeptidase
Type:PROTEIN
Mol. Mass.:117334.10
Organism:Homo sapiens (Human)
Description:ChEMBL_1473494
Residue:1025
BDBM50331048
NameBDBM50331048
Synonyms:CHEMBL1277437 | ethyl 2-acetamido-7-hydroxy-4-(quinolin-3-yl)-4H-chromene-3-carboxylate
TypeSmall organic molecule
Emp. Form.C23H20N2O5
Mol. Mass.404.4153
SMILESCCOC(=O)C1=C(NC(C)=O)Oc2cc(O)ccc2C1c1cnc2ccccc2c1