Reaction Details
TargetNitric oxide synthase, brain
LigandBDBM50448833
Substrate/Competitorn/a
Meas. Tech.ChEMBL_1298288 (CHEMBL3130553)
Ki 11±n/a nM
Citation Cinelli, MALi, HChreifi, GMartásek, PRoman, LJPoulos, TLSilverman, RB Simplified 2-aminoquinoline-based scaffold for potent and selective neuronal nitric oxide synthase inhibition. J Med Chem57:1513-30 (2014) 
 
Nitric oxide synthase, brain
Name:Nitric oxide synthase, brain
Type:Enzyme
Mol. Mass.:160570.98
Organism:Rattus norvegicus (rat)
Description:Recombinant nNOS overexpressed in E. coli was used in enzyme assays.
Residue:1429
BDBM50448833
NameBDBM50448833
Synonyms:CHEMBL3125048
TypeSmall organic molecule
Emp. Form.C20H20FN3S
Mol. Mass.353.456
SMILESNC(=Nc1cccc(CNCCc2cccc(F)c2)c1)c1cccs1