Reaction Details
TargetNitric oxide synthase, endothelial
LigandBDBM50449048
Substrate/Competitorn/a
Meas. Tech.ChEMBL_1298290 (CHEMBL3130555)
Ki 485±n/a nM
Citation Cinelli, MALi, HChreifi, GMartásek, PRoman, LJPoulos, TLSilverman, RB Simplified 2-aminoquinoline-based scaffold for potent and selective neuronal nitric oxide synthase inhibition. J Med Chem57:1513-30 (2014) 
 
Nitric oxide synthase, endothelial
Name:Nitric oxide synthase, endothelial
Type:Enzyme
Mol. Mass.:133292.26
Organism:Bos taurus (bovine)
Description:Recombinant eNOS overexpressed in E. coli was used in enzyme assays.
Residue:1205
BDBM50449048
NameBDBM50449048
Synonyms:CHEMBL3126213 | US9212144, 5 (Ex. 8)
TypeSmall organic molecule
Emp. Form.C18H18FN3
Mol. Mass.295.354
SMILESNc1ccc2ccc(CNCCc3cccc(F)c3)cc2n1