Reaction Details
TargetGlucocorticoid receptor
LigandBDBM50449062
Substrate/Competitorn/a
Meas. Tech.ChEMBL_1295696 (CHEMBL3132583)
IC50 44±n/a nM
Citation Harcken, CRiether, DKuzmich, DLiu, PBetageri, RRalph, MEmmanuel, MReeves, JTBerry, ASouza, DNelson, RMKukulka, AFadra, TNZuvela-Jelaska, LDinallo, RBentzien, JNabozny, GHThomson, DS Identification of highly efficacious glucocorticoid receptor agonists with a potential for reduced clinical bone side effects. J Med Chem57:1583-98 (2014) 
 
Glucocorticoid receptor
Name:Glucocorticoid receptor
Type:Enzyme
Mol. Mass.:85656.87
Organism:Homo sapiens (Human)
Description:P04150
Residue:777
BDBM50449062
NameBDBM50449062
Synonyms:CHEMBL3126943
TypeSmall organic molecule
Emp. Form.C20H22F3N3O
Mol. Mass.377.4034
SMILESCc1ccccc1C(C)(C)CC(O)(Cc1cc2ncncc2[nH]1)C(F)(F)F