Reaction Details
TargetGlucocorticoid receptor
LigandBDBM50449074
Substrate/Competitorn/a
Meas. Tech.ChEMBL_1295696 (CHEMBL3132583)
IC50 10.0±n/a nM
Citation Harcken, CRiether, DKuzmich, DLiu, PBetageri, RRalph, MEmmanuel, MReeves, JTBerry, ASouza, DNelson, RMKukulka, AFadra, TNZuvela-Jelaska, LDinallo, RBentzien, JNabozny, GHThomson, DS Identification of highly efficacious glucocorticoid receptor agonists with a potential for reduced clinical bone side effects. J Med Chem57:1583-98 (2014) 
 
Glucocorticoid receptor
Name:Glucocorticoid receptor
Type:Enzyme
Mol. Mass.:85656.87
Organism:Homo sapiens (Human)
Description:P04150
Residue:777
BDBM50449074
NameBDBM50449074
Synonyms:CHEMBL3126954
TypeSmall organic molecule
Emp. Form.C20H21F4N3O2
Mol. Mass.411.3933
SMILESCOc1ccc(F)cc1C(C)(C)CC(O)(Cc1cc2cncnc2[nH]1)C(F)(F)F