Reaction Details
TargetMineralocorticoid receptor
LigandBDBM50449067
Substrate/Competitorn/a
Meas. Tech.ChEMBL_1295697 (CHEMBL3132584)
IC50 170±n/a nM
Citation Harcken, CRiether, DKuzmich, DLiu, PBetageri, RRalph, MEmmanuel, MReeves, JTBerry, ASouza, DNelson, RMKukulka, AFadra, TNZuvela-Jelaska, LDinallo, RBentzien, JNabozny, GHThomson, DS Identification of highly efficacious glucocorticoid receptor agonists with a potential for reduced clinical bone side effects. J Med Chem57:1583-98 (2014) 
 
Mineralocorticoid receptor
Name:Mineralocorticoid receptor
Type:Enzyme
Mol. Mass.:107076.42
Organism:Homo sapiens (Human)
Description:P08235
Residue:984
BDBM50449067
NameBDBM50449067
Synonyms:CHEMBL3126938
TypeSmall organic molecule
Emp. Form.C24H28F4N4O2
Mol. Mass.480.4983
SMILESCc1ccc(F)cc1C(C)(C)CC(O)(Cc1cc2nc(ncc2[nH]1)N1CCOCC1)C(F)(F)F