Reaction Details
TargetXanthine dehydrogenase/oxidase
LigandBDBM50449104
Substrate/Competitorn/a
Meas. Tech.ChEMBL_1296862 (CHEMBL3129612)
IC50 1.000000±n/a nM
Citation Evenäs, JEdfeldt, FLepistö, MSvitacheva, NSynnergren, ALundquist, BGränse, MRönnholm, AVarga, MWright, JWei, MYue, SWang, JLi, CLi, XChen, GLiao, YLv, GTjörnebo, ANarjes, F HTS followed by NMR based counterscreening. Discovery and optimization of pyrimidones as reversible and competitive inhibitors of xanthine oxidase. Bioorg Med Chem Lett24:1315-21 (2014) 
 
Xanthine dehydrogenase/oxidase
Name:Xanthine dehydrogenase/oxidase
Type:Enzyme
Mol. Mass.:146441.21
Organism:Homo sapiens (Human)
Description:P47989
Residue:1333
BDBM50449104
NameBDBM50449104
Synonyms:CHEMBL3127117
TypeSmall organic molecule
Emp. Form.C16H15ClF3N3O4
Mol. Mass.405.756
SMILESNc1nc(c(Cl)c(=O)[nH]1)-c1ccc(OCC2CCOC2)c(OC(F)(F)F)c1