Reaction Details
TargetXanthine dehydrogenase/oxidase
LigandBDBM50449119
Substrate/Competitorn/a
Meas. Tech.ChEMBL_1296862 (CHEMBL3129612)
IC50 200±n/a nM
Citation Evenäs, JEdfeldt, FLepistö, MSvitacheva, NSynnergren, ALundquist, BGränse, MRönnholm, AVarga, MWright, JWei, MYue, SWang, JLi, CLi, XChen, GLiao, YLv, GTjörnebo, ANarjes, F HTS followed by NMR based counterscreening. Discovery and optimization of pyrimidones as reversible and competitive inhibitors of xanthine oxidase. Bioorg Med Chem Lett24:1315-21 (2014) 
 
Xanthine dehydrogenase/oxidase
Name:Xanthine dehydrogenase/oxidase
Type:Enzyme
Mol. Mass.:146441.21
Organism:Homo sapiens (Human)
Description:P47989
Residue:1333
BDBM50449119
NameBDBM50449119
Synonyms:CHEMBL3127122
TypeSmall organic molecule
Emp. Form.C11H8F3N3O2
Mol. Mass.271.1953
SMILESNc1nc(cc(=O)[nH]1)-c1cccc(OC(F)(F)F)c1