Reaction Details
TargetAcetylcholinesterase
LigandBDBM50449215
Substrate/Competitorn/a
Meas. Tech.ChEMBL_1298301 (CHEMBL3130754)
IC50 270±n/a nM
Citation Bautista-Aguilera, OMEsteban, GBolea, INikolic, KAgbaba, DMoraleda, IIriepa, ISamadi, ASoriano, EUnzeta, MMarco-Contelles, J Design, synthesis, pharmacological evaluation, QSAR analysis, molecular modeling and ADMET of novel donepezil-indolyl hybrids as multipotent cholinesterase/monoamine oxidase inhibitors for the potential treatment of Alzheimer's disease. Eur J Med Chem75:82-95 (2014) 
 
Acetylcholinesterase
Name:Acetylcholinesterase
Type:Enzyme
Mol. Mass.:71812.79
Organism:Electrophorus electricus (Electric eel)
Description:n/a
Residue:633
BDBM50449215
NameBDBM50449215
Synonyms:CHEMBL3127974
TypeSmall organic molecule
Emp. Form.C29H37N3O3
Mol. Mass.475.6224
SMILESCn1c(cc2cc(OCCCC3CCN(Cc4ccccc4)CC3)ccc12)C(=O)N1CCOCC1