Reaction Details
TargetAcetylcholinesterase
LigandBDBM50449212
Substrate/Competitorn/a
Meas. Tech.ChEMBL_1298301 (CHEMBL3130754)
IC50 140±n/a nM
Citation Bautista-Aguilera, OMEsteban, GBolea, INikolic, KAgbaba, DMoraleda, IIriepa, ISamadi, ASoriano, EUnzeta, MMarco-Contelles, J Design, synthesis, pharmacological evaluation, QSAR analysis, molecular modeling and ADMET of novel donepezil-indolyl hybrids as multipotent cholinesterase/monoamine oxidase inhibitors for the potential treatment of Alzheimer's disease. Eur J Med Chem75:82-95 (2014) 
 
Acetylcholinesterase
Name:Acetylcholinesterase
Type:Enzyme
Mol. Mass.:71812.79
Organism:Electrophorus electricus (Electric eel)
Description:n/a
Residue:633
BDBM50449212
NameBDBM50449212
Synonyms:CHEMBL3127968
TypeSmall organic molecule
Emp. Form.C28H37N3O
Mol. Mass.431.6129
SMILESCn1c(CNCC=C)cc2cc(OCCCC3CCN(Cc4ccccc4)CC3)ccc12