Reaction Details
TargetSodium/glucose cotransporter 2
LigandBDBM50449244
Substrate/Competitorn/a
Meas. Tech.ChEMBL_1295138 (CHEMBL3128639)
IC50 0.670000±n/a nM
Citation Putapatri, SRKanwal, ABanerjee, SKKantevari, S Synthesis of novel l-rhamnose derived acyclic C-nucleosides with substituted 1,2,3-triazole core as potent sodium-glucose co-transporter (SGLT) inhibitors. Bioorg Med Chem Lett24:1528-31 (2014) 
 
Sodium/glucose cotransporter 2
Name:Sodium/glucose cotransporter 2
Type:Protein
Mol. Mass.:72902.00
Organism:Homo sapiens (Human)
Description:P31639
Residue:672
BDBM50449244
NameBDBM50449244
Synonyms:CHEMBL3125150
TypeSmall organic molecule
Emp. Form.C21H25ClO5
Mol. Mass.392.873
SMILESCCOc1ccc(Cc2cc(ccc2Cl)[C@@H]2O[C@H](C)[C@@H](O)[C@H](O)[C@H]2O)cc1