Reaction Details
TargetSodium/glucose cotransporter 1
LigandBDBM50449242
Substrate/Competitorn/a
Meas. Tech.ChEMBL_1295136 (CHEMBL3128637)
IC50 315±n/a nM
Citation Putapatri, SRKanwal, ABanerjee, SKKantevari, S Synthesis of novel l-rhamnose derived acyclic C-nucleosides with substituted 1,2,3-triazole core as potent sodium-glucose co-transporter (SGLT) inhibitors. Bioorg Med Chem Lett24:1528-31 (2014) 
 
Sodium/glucose cotransporter 1
Name:Sodium/glucose cotransporter 1
Type:Protein
Mol. Mass.:73503.78
Organism:Homo sapiens (Human)
Description:P13866
Residue:664
BDBM50449242
NameBDBM50449242
Synonyms:CHEMBL3125151
TypeSmall organic molecule
Emp. Form.C15H19N3O5
Mol. Mass.321.3285
SMILESCCOC(=O)c1nnn(c1[C@H](O)[C@@H](O)[C@H](C)O)-c1ccccc1