Reaction Details
TargetProstaglandin D2 receptor 2
LigandBDBM50449263
Substrate/Competitorn/a
Meas. Tech.ChEMBL_1295165 (CHEMBL3128666)
Ki 1.1±n/a nM
Citation Xiao, DZhu, XYu, YShao, NWu, JMcCormick, KDDhondi, PQin, JMazzola, RTang, HRao, ASiliphaivanh, PQiu, HYang, XRivelli, MGarlisi, CGEckel, SMukhopadhyay, GCorrell, CRindgen, DAslanian, RPalani, A Quality by design (QbD) of amide isosteres: 5,5-Disubstituted isoxazolines as potent CRTh2 antagonists with favorable pharmacokinetic and drug-like properties. Bioorg Med Chem Lett24:1615-20 (2014) 
 
Prostaglandin D2 receptor 2
Name:Prostaglandin D2 receptor 2
Type:Enzyme
Mol. Mass.:43295.45
Organism:Homo sapiens (Human)
Description:Q9Y5Y4
Residue:395
BDBM50449263
NameBDBM50449263
Synonyms:CHEMBL3125333
TypeSmall organic molecule
Emp. Form.C30H26FN3O4
Mol. Mass.511.5435
SMILESOC(=O)CCCCc1nc2cc(ccc2c(=O)n1-c1ccc(F)cc1)C1=NOC2(C1)Cc1ccccc1C2