Reaction Details
TargetTyrosine-protein kinase ZAP-70
LigandBDBM50449314
Substrate/Competitorn/a
Meas. Tech.ChEMBL_1296447 (CHEMBL3130287)
IC50 8600±n/a nM
Citation Zhao, HCaflisch, A Discovery of dual ZAP70 and Syk kinases inhibitors by docking into a rare C-helix-out conformation of Syk. Bioorg Med Chem Lett24:1523-7 (2014) 
 
Tyrosine-protein kinase ZAP-70
Name:Tyrosine-protein kinase ZAP-70
Type:Enzyme
Mol. Mass.:69881.61
Organism:Homo sapiens (Human)
Description:ZAP-70 SH2 domain was expressed and purified from E. coli using O-phospho-L-tyrosine-agarose column.
Residue:619
BDBM50449314
NameBDBM50449314
Synonyms:CHEMBL3125862
TypeSmall organic molecule
Emp. Form.C20H19N5O2S3
Mol. Mass.457.592
SMILESO=c1[nH]c(CSc2nnc(NCC3CCCO3)s2)nc2sc(cc12)-c1ccccc1