Reaction Details
TargetTyrosine-protein kinase SYK
LigandBDBM50449314
Substrate/Competitorn/a
Meas. Tech.ChEMBL_1296448 (CHEMBL3130288)
IC50 22600±n/a nM
Citation Zhao, HCaflisch, A Discovery of dual ZAP70 and Syk kinases inhibitors by docking into a rare C-helix-out conformation of Syk. Bioorg Med Chem Lett24:1523-7 (2014) 
 
Tyrosine-protein kinase SYK
Name:Tyrosine-protein kinase SYK
Type:Enzyme
Mol. Mass.:72079.99
Organism:Homo sapiens (Human)
Description:P43405
Residue:635
BDBM50449314
NameBDBM50449314
Synonyms:CHEMBL3125862
TypeSmall organic molecule
Emp. Form.C20H19N5O2S3
Mol. Mass.457.592
SMILESO=c1[nH]c(CSc2nnc(NCC3CCCO3)s2)nc2sc(cc12)-c1ccccc1